VAERS_ID,status,VAX_LOT,lot_fix,VAX_DATE,ONSET_DATE,RECVDATE,RPT_DATE,TODAYS_DATE,age_fix,AGE_YRS,SEX,Location,DIED,DATEDIED,L_THREAT,ER_VISIT,HOSPITAL,HOSPDAYS,X_STAY,DISABLE,RECOVD,NUMDAYS,BIRTH_DEFECT,OFC_VISIT,ER_ED_VISIT,VAX_DOSE_SERIES,VAX_ROUTE,VAX_SITE,VAX_NAME,CAGE_YR,CAGE_MO,LAB_DATA,V_ADMINBY,V_FUNDBY,OTHER_MEDS,CUR_ILL,HISTORY,PRIOR_VAX,SPLTTYPE,FORM_VERS,ALLERGIES,SYMPTOM_TEXT,symptom_entries
2404825,,020E21A,020E21A,01/16/2022,08/03/2022,08/09/2022,,08/08/2022,41,41,M,Canada,,,,,,,,,U,199,,,,3,OT,LA,C19 Pfizer-BionT,,,Test Date: 20220803; Test Name: Home Test Nasal Swab; Test Result: Positive,OTH,,,,,,CAPFIZER INC202201041195,2,,"Tested positive for Covid-19 (Home Test); Tested positive for Covid-19 (Home Test); This is a spontaneous report received from a contactable reporter(s) (Consumer or other non HCP). The reporter is the patient.  A 41-year-old male patient received BNT162b2 (COMIRNATY), on 06May2021 as dose 1, single (Lot number: EW0193), on 26Jul2021 as dose 2, single (Lot number: FD7206), in left arm and on 16Jan2022 as dose 3 (booster), single (Lot number: 020E21A) at the age of 41 years, in left arm, all intramuscular for covid-19 immunisation; coviD-19 vaccine mrna (mrna 1273) (SPIKEVAX), on 07Jun2022 as dose 4 (booster), single (Batch/Lot number: unknown) for covid-19 immunisation. The patient's relevant medical history and concomitant medications were not reported. The following information was reported: DRUG INEFFECTIVE (medically significant), COVID-19 (medically significant) all with onset 03Aug2022, outcome unknown and all described as Tested positive for Covid-19 (Home Test). The patient underwent the following laboratory tests and procedures: SARS-CoV-2 test: (03Aug2022) Positive. Therapeutic measures were not taken as a result of drug ineffective, covid-19.; Sender's Comments: Linked Report(s) : CA-PFIZER INC-202201037917 Same patient and suspect drug; different dose and events;",_|_COVID-19_|_Drug ineffective_|_SARS-CoV-2 test_|_
2630885,,020E21A,020E21A,03/16/2022,03/16/2022,05/12/2023,,05/12/2023,,,U,Canada,,,,,,,,,U,0,,,,UNK,OT,,C19 Moderna,,,,UNK,,,,,,"CAMODERNATX, INC.MOD20237",2,,"no adverse event; Patient vaccinated with monovalent Spikevax vaccine which was already been expired; This spontaneous case was reported by a nurse and describes the occurrence of EXPIRED PRODUCT ADMINISTERED ( ...^... ) and NO ADVERSE EVENT (no adverse event) in an adult patient of an unknown gender who received mRNA-1273 (Spikevax) (batch no. 020E21A) for COVID-19 prophylaxis.     No Medical History information was reported.    On 16-Mar-2022, the patient received dose of mRNA-1273 (Spikevax) (unknown route) 1 dosage form. On 16-Mar-2022,  after starting mRNA-1273 (Spikevax), the patient experienced EXPIRED PRODUCT ADMINISTERED ( ...^... ). On an unknown date, the patient experienced NO ADVERSE EVENT (no adverse event). At the time of the report, EXPIRED PRODUCT ADMINISTERED ( ...^... ) and NO ADVERSE EVENT (no adverse event) outcome was unknown.        For mRNA-1273 (Spikevax) (Unknown), the reporter considered NO ADVERSE EVENT (no adverse event) to be not related. No further causality assessment was provided for EXPIRED PRODUCT ADMINISTERED ( ...^... ).    No concomitant medication information was reported. It was unknown if the patient received any other vaccine in the 4 weeks prior to COVID-19 vaccine. No treatment medication information was reported.   This case was linked to CA-MODERNATX, INC.-MOD-2023-723614 (E2B Linked Report).   Most recent FOLLOW-UP information incorporated above includes: On 08-May-2023: No new information received. On 09-May-2023: No new information received.; Sender's Comments:  CA-MODERNATX, INC.-MOD-2023-723614:patient no 1",_|_Expired product administered_|_No adverse event_|_
2098690,,020E21A,020E21A,10/19/2021,01/20/2022,02/09/2022,,02/09/2022,83,83,M,KY,Y,01/27/2022,,,,,,,N,93,,,,2,IM,UN,C19 Moderna,83,,Case tested positive for COVID on 1-20-22.,SEN,,unknown,unknown,"congestive heart failure, Crohn's disease, rheumatoid arthritis",,,2,unknown,Case tested positive for COVID-19 on 1-20-22 and died on 1-27-22.,_|_COVID-19_|_Death_|_SARS-CoV-2 test positive_|_
1440697,,001C21A|020E21A,020E21A|001C21A,04/27/2021,04/27/2021,07/01/2021,,07/01/2021,46,46,F,CA,,,,,,,,,,0,,Y,,2|1,SYR|SYR,RA|RA,C19 Moderna|C19 Moderna,46,,,OTH,,Claritin Nessiun biotins injections bit ox injections Odastrian  sirreva Paladai Neclozime ibeprohen 800 mg ( did not take 3 days prior to vaccine metronidavole keticoldone sluocineone  triamoinolone monetasone elidle lotracainde Benadryl p,,Asthma COPD GI issues Ball symdrome obesity Chronic pain Arhtritis tendanitis carpotonal Migraines Vertigo Immune disease,,,2,Penecilin Codine Zrytec Patient does have other medication alleries but she can not access the file at this time. fish  soy  msg Bannanna wines red viniger,"Patient stated that about 45 mins Vaccination her face became red, it began burring and tingly. Patient also had burning and tingly sensation in the back of her head like a migraine. Patient had trouble swelling and numbness. Patient is still having redness and numbness on face.",_|_Burning sensation_|_Erythema_|_Hypoaesthesia_|_Paraesthesia_|_Swelling_|_
1901304,,025A21A,020E21A|025A21A,03/02/2021,11/17/2021,11/26/2021,,11/25/2021,65,65,M,CO,,,,,,,,,N,260,,,,2,OT,,C19 Moderna,64,,,UNK,,,,"Medical History/Concurrent Conditions: COVID-19 (Was sick for almost 8 months; was constantly on low dose Medrol pack and doxycycline); Wheezing (Still experiencing wheezing, after recovering from COVID)",,"USMODERNATX, INC.MOD20213",2,,"Feel really sick; Really freezing/ Really cold; Feeling lousy/ Do not feel well; Jittery; Tired; Body aches; This spontaneous case was reported by a consumer and describes the occurrence of ILLNESS (Feel really sick), FEELING COLD (Really freezing/ Really cold), MALAISE (Feeling lousy/ Do not feel well), FEELING JITTERY (Jittery) and FATIGUE (Tired) in a 65-year-old male patient who received mRNA-1273 (Moderna COVID-19 Vaccine) (batch nos. 065F21A, 025A21A and 020E21A) for COVID-19 vaccination. The occurrence of additional non-serious events is detailed below.     The patient's past medical history included COVID-19 (Was sick for almost 8 months; was constantly on low dose Medrol pack and doxycycline) in 2020 and Wheezing (Still experiencing wheezing, after recovering from COVID).   On 02-Mar-2021, the patient received first dose of mRNA-1273 (Moderna COVID-19 Vaccine) (unknown route) 1 dosage form. On 30-Mar-2021, received second dose of mRNA-1273 (Moderna COVID-19 Vaccine) (unknown route) dosage was changed to 1 dosage form. On 17-Nov-2021, received third dose of mRNA-1273 (Moderna COVID-19 Vaccine) (unknown route) dosage was changed to 1 dosage form. On 17-Nov-2021, the patient experienced ILLNESS (Feel really sick), FEELING COLD (Really freezing/ Really cold), MALAISE (Feeling lousy/ Do not feel well), FEELING JITTERY (Jittery), FATIGUE (Tired) and MYALGIA (Body aches). The patient was treated with IBUPROFEN (ADVIL [IBUPROFEN]) for Adverse event, at a dose of 1 dosage form. At the time of the report, ILLNESS (Feel really sick), FEELING COLD (Really freezing/ Really cold), MALAISE (Feeling lousy/ Do not feel well), FEELING JITTERY (Jittery), FATIGUE (Tired) and MYALGIA (Body aches) had not resolved.            No concomitant medications was provided by reporter.  After getting the booster dose, patient was feeling really sick, really freezing, really cold, jittery, tired, having body aches, feeling lousy, do not feel well and tired. Patient had taken Advil which may have alleviated the symptoms little but not completely.   This case was linked to MOD-2021-390907, MOD-2021-390908 (Patient Link).",_|_Fatigue_|_Feeling cold_|_Feeling jittery_|_Illness_|_Malaise_|_Myalgia_|_
1901313,,025A21A,020E21A|025A21A,03/02/2021,,11/26/2021,,11/25/2021,65,65,M,CO,,,,,,,,,U,,,,,3,OT,,C19 Moderna,64,,,UNK,,,,,,"USMODERNATX, INC.MOD20213",2,,"similar reaction after 2nd dose; freezing and tired; with wheezing that he was experiencing and helped further more when he took the 2nd dose.; similar reaction after 2nd dose; freezing and tired; This spontaneous case was reported by a patient and describes the occurrence of FEELING COLD (similar reaction after 2nd dose; freezing and tired), THERAPEUTIC RESPONSE UNEXPECTED ( ...^... .) and FATIGUE (similar reaction after 2nd dose; freezing and tired) in a 65-year-old male patient who received mRNA-1273 (Moderna COVID-19 Vaccine) (batch nos. 020E21A, 025A21A and 065F21A) for COVID-19 vaccination.     No Medical History information was reported.   On 02-Mar-2021, the patient received first dose of mRNA-1273 (Moderna COVID-19 Vaccine) (unknown route) 1 dosage form. On 30-Mar-2021, received second dose of mRNA-1273 (Moderna COVID-19 Vaccine) (unknown route) dosage was changed to 1 dosage form. On 17-Nov-2021, received third dose of mRNA-1273 (Moderna COVID-19 Vaccine) (unknown route) dosage was changed to 1 dosage form. On an unknown date, the patient experienced FEELING COLD (similar reaction after 2nd dose; freezing and tired), THERAPEUTIC RESPONSE UNEXPECTED ( ...^... .) and FATIGUE (similar reaction after 2nd dose; freezing and tired). The patient was treated with IBUPROFEN (ADVIL [IBUPROFEN]) for Adverse event, at an unspecified dose and frequency. At the time of the report, FEELING COLD (similar reaction after 2nd dose; freezing and tired), THERAPEUTIC RESPONSE UNEXPECTED ( ...^... .) and FATIGUE (similar reaction after 2nd dose; freezing and tired) outcome was unknown.            Concomitant medications details were not reported by the reporter.   This case was linked to MOD-2021-390907, MOD-2021-390861 (Patient Link).",_|_Fatigue_|_Feeling cold_|_Therapeutic response unexpected_|_
2315348,,020E21A|EP6017,020E21A|EP6017,05/16/2021,05/25/2022,06/10/2022,,06/10/2022,58,58,F,Canada,,,,,,,,,N,374,,,,3|2,OT|OT,|LA,C19 Moderna|C19 Pfizer-BionT,,,Test Name: SARS CoV-2 Test; Test Result: Positive  ; Result Unstructured Data: positive,UNK,,,,,,"CAMODERNATX, INC.MOD20225",2,,"Patient received 2 doses of Tozinameran vaccine and third dose of spikevax; Vaccination failure; Covid-19; This spontaneous case was reported by a consumer and describes the occurrence of VACCINATION FAILURE (Vaccination failure) and COVID-19 (Covid-19) in a 58-year-old female patient who received mRNA-1273 (Moderna CoviD-19 Vaccine) (batch no. 020E21A) for COVID-19 immunisation. The occurrence of additional non-serious events is detailed below.    Co-suspect product included non-company product TOZINAMERAN (COVID-19 MRNA VACCINE BNT162B2) for COVID-19 immunisation.    Previously administered products included for COVID-19 immunisation: BNT162b2 (BNT162B2) (As dose 1 and single (LOT number: EN1198) in left arm) on 23-Apr-2021. Past adverse reactions to the above products included No adverse event with BNT162b2 (BNT162B2).   On 16-May-2021, the patient received third dose of mRNA-1273 (Moderna CoviD-19 Vaccine) (unknown route) 1 dosage form and second dose of TOZINAMERAN (COVID-19 MRNA VACCINE BNT162B2) (Intramuscular) 1 dosage form. On 25-May-2022, the patient experienced VACCINATION FAILURE (Vaccination failure) (seriousness criterion medically significant). 25-May-2022, the patient experienced COVID-19 (Covid-19) ( who experienced the unexpected serious ). On an unknown date, the patient experienced INTERCHANGE OF VACCINE PRODUCTS (19 after receiving a booster dose of mRNA). At the time of the report, VACCINATION FAILURE (Vaccination failure) and INTERCHANGE OF VACCINE PRODUCTS ( Onset latency cannot be determined because vaccination dates need clarification) outcome was unknown and COVID-19 (Covid-19) was resolving.      DIAGNOSTIC RESULTS (normal ranges are provided in parenthesis if available): On an unknown date, SARS-CoV-2 test: positive (Positive) positive.         Concomitant and Treatment information was not provided.   Company comment: This spontaneous case concerns a 58-year-old female patient, with no reported medical history, Patient previously received 2 doses of Tozinameran vaccine (medically significant) AESI of COVID- hence vaccination failure cannot be concluded in this case-1273 vaccine. Additionally, Vaccination failure was also reported. Clinical course and treatment details were not reported. The outcome of event was reported as resolving(interchange of vaccine products), Event was assessed based on medical judgement. SARS-CoV-2 test was reported positive. ...^... . ...^... . The benefit-risk relationship of mRNA-1273 is not affected by this report. ...^... .; Sender's Comments: This spontaneous case concerns a 58-year-old female patient, with no reported medical history, ...^... (medically significant) AESI of COVID- ...^... -1273 vaccine. Additionally, Vaccination failure was also reported. ...^... . ...^... (interchange of vaccine products), ...^... . SARS-CoV-2 test was reported positive. ...^... . ...^... . The benefit-risk relationship of mRNA-1273 is not affected by this report. ...^... .",_|_COVID-19_|_Interchange of vaccine products_|_SARS-CoV-2 test_|_Vaccination failure_|_
2309981,,EP6017,020E21A|EP6017,05/16/2021,05/25/2022,06/06/2022,,06/06/2022,57,57,F,Canada,,,,,,,,,N,374,,,,2,OT,LA,C19 Pfizer-BionT,,,Test Name: COVID-19 test; Test Result: Positive,OTH,,,,,,CAPFIZER INC202200792710,2,,"COVID 19; COVID 19; This is a spontaneous report received from a contactable reporter(s) (Consumer or other non HCP). The reporter is the patient.  A 58-year-old female patient (not pregnant) received BNT162b2 (BNT162B2), on 23Apr2021 as dose 1, single (Lot number: EN1198), in left arm and on 16May2021 as dose 2, single (Lot number: EP6017) at the age of 57 years, in left arm, all intramuscular for covid-19 immunisation; coviD-19 vaccine mrna (mrna 1273) (SPIKEVAX), on 16May2021 as dose 3 (booster), single (Lot number: 020E21A) for covid-19 immunisation. The patient's relevant medical history and concomitant medications were not reported. The following information was reported: VACCINATION FAILURE (medically significant) with onset 25May2022, outcome unknown, COVID-19 (medically significant) with onset 25May2022, outcome recovering and all described as COVID 19. The patient underwent the following laboratory tests and procedures: SARS-CoV-2 test negative: Positive. Therapeutic measures were not taken as a result of vaccination failure, covid-19.",_|_COVID-19_|_SARS-CoV-2 test_|_Vaccination failure_|_
2244888,,EY4825,020E21A|EY4825,05/01/2021,04/14/2022,04/21/2022,,04/20/2022,,,U,Canada,,,,,,,,,N,348,,,,1,,,C19 Pfizer-BionT,,,Test Date: 20220416; Test Name: Rapid Test; Result Unstructured Data: Test Result:Positive; Comments: Other,OTH,,,,,,CAPFIZER INC202200589544,2,,"COVID positive as of April 16 2022; COVID positive as of April 16 2022; This is a spontaneous report received from a contactable reporter(s) (Consumer or other non HCP). The reporter is the patient.  A patient (no qualifiers provided) received BNT162b2 (BNT162B2), on 01May2021 as dose 1, single (Lot number: EY4825) and on 28Jun2021 as dose 2, single (Lot number: EY0585) for covid-19 immunisation; coviD-19 vaccine mrna (mrna 1273) (MODERNA COVID-19 VACCINE), on 05Feb2022 (Lot number: 020E21A) for covid-19 immunisation. The patient's relevant medical history and concomitant medications were not reported. The following information was reported: COVID-19 (medically significant) with onset 14Apr2022, outcome not recovered, DRUG INEFFECTIVE (medically significant), outcome unknown and all described as COVID positive as of April 16 2022. The patient underwent the following laboratory tests and procedures: SARS-CoV-2 test: (16Apr2022) Positive, notes: Other. No follow-up attempts are possible. No further information is expected.",_|_COVID-19_|_Drug ineffective_|_SARS-CoV-2 test_|_
2612975,,020J21A,020J21A,04/09/2022,12/17/2022,04/11/2023,,04/11/2023,67,67,M,AL,,,,,,,,,U,252,,Y,,4,SYR,UN,C19 Moderna,67,,Yes,PHM,,Multivitamin,,,,vsafe,2,Tetanus,"My symptoms started on December 17, 2022 I experienced a Cerebellar Stroke.",_|_Cerebellar stroke_|_
2263097,,020J21A,020J21A,12/13/2021,04/29/2022,05/04/2022,,05/04/2022,70,70,F,Canada,,,,,,,,,N,137,,,,3,,RA,C19 Pfizer-BionT,,,Test Date: 20220429; Test Name: SARS-CoV-2 test; Test Result: Positive.,OTH,,,,Medical History/Concurrent Conditions: Allergy,,CAPFIZER INC202200644674,2,,"This is a spontaneous report received from contactable reporter(s) (Consumer or other non HCP). The reporter is the patient. A 71-year-old female patient (not pregnant) received BNT162b2 (COMIRNATY), on 04Apr2021 at 12:00 as dose 1, single (Lot number: EW3344), in right arm, on 14Jun2021 at 14:00 as dose 2, single (Lot number: EY0578), in left arm and on 13Dec2021 at 13:00 as dose 3 (booster), single (Lot number: FF5109) at the age of 70 years, in right arm for Covid-19 immunisation; CoviD-19 vaccine mRNA (mRNA 1273) (MODERNA COVID-19 VACCINE), on 12Apr2022 as dose 4 (booster), single (Lot number: 020J21A), in right arm. The patient's relevant medical history included: Allergy (unspecified if ongoing). The patient's concomitant medications were not reported. The following information was reported: DRUG INEFFECTIVE (medically significant), COVID-19 (medically significant) all with onset 29Apr2022 at 06:00, outcome not recovered and all described as I tested positive again for Covid. The patient underwent the following laboratory tests and procedures: SARS-CoV-2 test: (29Apr2022) positive. Therapeutic measures were not taken as a result of drug ineffective, Covid-19. Clinical course: Did the patient previously receive a COVID-19 Vaccine reported as yes. After taking the Paxlovid for 5 days patient tested positive again for Covid 7 days later. Was the patient taking any other medications/products within 2 weeks of starting COVID-19 treatment reported as no.",_|_COVID-19_|_Drug ineffective_|_SARS-CoV-2 test_|_
2489764,,020J21A,020J21A,01/10/2022,,10/26/2022,,10/26/2022,,,M,Canada,,,,,Y,,,,Y,,,,,3,OT,,C19 Moderna,,,,UNK,,,Anxiety; Bipolar affective disorder; Transgender,,,"CAMODERNATX, INC.MOD20226",2,,"Radiating pain; Chills; Myopericarditis; This spontaneous case was reported by a physician and describes the occurrence of PAIN (Radiating pain), CHILLS (Chills) and MYOPERICARDITIS (Myopericarditis) in an adult male patient who received mRNA-1273 (Spikevax) (batch no. 020J21A) for COVID-19 prophylaxis.     Previously administered products included for Drug use for unknown indication: LORAZEPAM, QUETIAPINE, ESTRADOT (ESTRADOT 100) and ANDROCUR. Past adverse reactions to the above products included No adverse reaction with ANDROCUR, ESTRADOT, LORAZEPAM and QUETIAPINE. Concurrent medical conditions included Anxiety, Bipolar affective disorder and Transgender.    On 10-Jan-2022, the patient received third dose of mRNA-1273 (Spikevax) (unknown route) 1 dosage form. On an unknown date, the patient experienced PAIN (Radiating pain) (seriousness criterion hospitalization), CHILLS (Chills) (seriousness criterion hospitalization) and MYOPERICARDITIS (Myopericarditis) (seriousness criteria hospitalization and medically significant). At the time of the report, PAIN (Radiating pain), CHILLS (Chills) and MYOPERICARDITIS (Myopericarditis) had resolved.        For mRNA-1273 (Spikevax) (Unknown), the reporter did not provide any causality assessments.   Patient's age group was reported as 18 to 49 years.  No concomitant medication was reported.  On an unknown date, the patient experienced chest pain (seriousness criterion hospitalization), slight fever (seriousness criterion hospitalization) and chest tightness (seriousness criterion hospitalization). At the time of the report, chest pain, slight fever and chest tightness had resolved.  No treatment medication was reported.  The report was received from the RA program.  Company Comment:  This spontaneous case concerns an adult male patient with no relevant medical history, who experienced the unexpected, serious  (hospitalized) events of Pain (reported as Radiating pain), Chills, and expected, serious (hospitalized and medically significant) adverse event of special interest Myopericarditis after receiving mRNA-1273 vaccine as third dose in the COVID-19 vaccination series. The event Chills occurred after 39 days, and the events Pain, and Myopericarditis occurred after 40 days of vaccine administration. Treatment, clinical course, and pertinent investigations were not disclosed.  Outcome of all the events was reported as resolved. No information on any other doses of COVID-19 vaccination was provided. The benefit-risk relationship of mRNA-1273 vaccine is not affected by this report.; Sender's Comments: This spontaneous case concerns an adult male patient with no relevant medical history, who experienced the unexpected, serious  (hospitalized) events of Pain (reported as Radiating pain), Chills, and expected, serious (hospitalized and medically significant) ...^... -1273 vaccine as third dose in the COVID-19 vaccination series. ...^... , and the events Pain, ...^... . Treatment, clinical course, ...^... . ...^... . ...^... -19 vaccination was provided. The benefit-risk relationship of mRNA- ...^... .",_|_Chills_|_Myopericarditis_|_Pain_|_